Translation(s): none

(!) ?Discussion


Found here Acid3 Test result with all browser (lastest version) under Debian using http://acid3.acidtests.org

Debian/Lenny

Arora

Package:

arora 0.2-1

Result rendering:

arora.png

Log:

Failed 0 tests.
Test 26 passed, but took 50ms (less than 30fps)
Test 69 passed, but took 97 attempts (less than perfect).
Total elapsed time: 2.98s

Chrome

Package: From repository: deb http://dl.google.com/linux/deb/ stable main non-free

google-chrome-unstable 4.0.223.11-r29900

Result rendering:

chrome.png

Log:

Failed 0 tests.
Test 01 passed, but took 108ms (less than 30fps)
Test 26 passed, but took 233ms (less than 30fps)
Test 69 passed, but took 137 attempts (less than perfect).
Test 75 passed, but took 97ms (less than 30fps)
Total elapsed time: 4.61s

Epiphany

Package:

epiphany-browser 2.22.3-9

Result rendering:

epiphany.png

Log:

Failed 28 tests. Test 01 failed: Component returned failure code: 0x80004001 (NS_ERROR_NOT_IMPLEMENTED) [nsIDOMDocumentTraversal.createNodeIterator]
Test 02 failed: Component returned failure code: 0x80004001 (NS_ERROR_NOT_IMPLEMENTED) [nsIDOMDocumentTraversal.createNodeIterator]
Test 03 failed: Component returned failure code: 0x80004001 (NS_ERROR_NOT_IMPLEMENTED) [nsIDOMDocumentTraversal.createNodeIterator]
Test 04 failed: Component returned failure code: 0x80004001 (NS_ERROR_NOT_IMPLEMENTED) [nsIDOMDocum

I can't see all message

kazehakase

Package:

kazehakase 0.5.4-2.2

Result rendering:

kazehakase.png

Log:

Failed 28 tests.
Test 01 failed: Component returned failure code: 0x80004001 (NS_ERROR_NOT_IMPLEMENTED) [nsIDOMDocumentTraversal.createNodeIterator]
Test 02 failed: Component returned failure code: 0x80004001 (NS_ERROR_NOT_IMPLEMENTED) [nsIDOMDocumentTraversal.createNodeIterator]
Test 03 failed: Component returned failure code: 0x80004001 (NS_ERROR_NOT_IMPLEMENTED) [nsIDOMDocumentTraversal.createNodeIterator]
Test 04 failed: Component returned failure code: 0x80004001 (NS_ERROR_NOT_IMPLEMENTED) [nsIDOMDocumentTraversal.createNodeIterator]
Test 07 failed: Component returned failure code: 0x80004005 (NS_ERROR_FAILURE) [nsIDOMRange.cloneContents]
Test 09 failed: expected 'Hello Wonderful KittyHow are you?' but got '' - toString() on range selecting Document gave wrong output
Test 10 failed: expected 'result' but got '' - toString() didn't work for attribute node
Test 11 failed: when inserting <a> into Document with another child: wrong exception raised
Test 26 passed, but took 290ms (less than 30fps)
Test 30 failed: Component returned failure code: 0x80070057 (NS_ERROR_ILLEGAL_VALUE) [nsIDOMEventTarget.dispatchEvent]
Test 33 failed: expected '1' but got '0' - whitespace error in class processing
Test 38 failed: p.childNodes[1].replaceWholeText is not a function
Test 39 failed: expected '1' but got '0' - :nth-child(odd) failed with child 0
Test 40 failed: expected '1' but got '0' - part 1:0
Test 46 failed: expected 'uppercase' but got 'none' - case a failed (index 1)
Test 54 failed: expected 'HIDDEN' but got 'hidden' - input control's type content attribute was wrong
Test 60 failed: attribute not specified after removal
Test 61 failed: expected ' te  st ' but got 'te st' - class attribute's value was wrong
Test 65 passed, but took 63ms (less than 30fps)
Test 70 failed: UTF-8 encoded XML document with invalid character did not have a well-formedness error
Test 71 failed: expected 'null' but got '' - internalSubset wrong (first test)
Test 74 failed: getSVGDocument missing on <iframe> element.
Test 75 failed: anim.beginElement is not a function
Test 76 failed: expected '0' but got '100' - Incorrect animVal value after svg animation.
Test 77 failed: expected '4776' but got '7180' - getComputedTextLength failed.
Test 78 failed: expected '90' but got '0' - getRotationOfChar(0) failed.
Test 79 failed: expected '34' but got '33' - SVGSVGTextElement.getNumberOfChars() incorrect
Test 82 failed: unexpected 1 in t3
Test 95 failed: expected 'string' but got 'number' - type of |"2147483648"| is not string
Test 98 failed: expected 'Sparrow' but got '' - document.title did not update dynamically
Total elapsed time: 0.87s

Konqueror

Package:

konqueror 4:3.5.10.dfsg.1-2

Result rendering:

konqueror.png

Log:

Failed 48 tests.
Test 01 failed: method [object NodeIterator].nextNode() didn't forward exception
Test 02 failed: reached expectation 2 when expecting expectation 1
Test 03 failed: Null value
Test 04 failed: expected '[object BODY]' but got 'null' - expectation 1 failed
Test 05 failed: expected '[object H1]' but got '[object Text]' - expectation 4 failed
Test 06 failed: expected '[object BODY]' but got 'null' - basic use of TreeWalker failed: previousNode()
Test 07 failed: cloneContents() didn't return an object
Test 08 failed: DOM Exception 3
Test 09 failed: expected 'ful Kitty' but got 'ful KittyHow are you?' - toString() on range crossing text nodes gave wrong output
Test 10 failed: expected 'result' but got '' - toString() didn't work for attribute node
Test 11 failed: when trying to surround two halves of comment: wrong exception raised; code = 3
Test 12 failed: range didn't start with the expected text; range stringified to ''
Test 13 failed: collapsed is wrong after deletion
Test 18 failed: expected '10' but got '1' - DOCTYPE nodeType wrong
Test 19 failed: exception HIERARCHY_REQUEST_ERR constant missing or wrong
Test 23 failed: no exception for createElementNS('null', ':div')
Test 25 failed: failed to raise exception
Test 26 failed: DOM Exception 3
Test 27 failed: Null value
Test 29 failed: expected '2' but got '1' - cloned table had wrong number of children
Test 35 failed: expected '1' but got '' - first child of root node didn't match :first-child
Test 38 failed: expected '1' but got '0' - element with a comment node and an empty text node didn't match :empty
Test 39 passed, but took 34ms (less than 30fps)
Test 40 failed: expected '0' but got '1' - part 9:1
Test 41 failed: expected '1' but got '' - head was not :not(:root)
Test 43 failed: expected '0' but got '1' - failure 9
Test 44 failed: expected '0' but got '1' - misparsed selectors
Test 46 failed: expected 'uppercase' but got 'none' - case a failed (index 1)
Test 47 failed: expected 'none' but got 'auto' - cursor none not supported
Test 51 failed: expected '6' but got '5' - wrong number of rows
Test 53 failed: expected '1' but got '0' - form's elements array has wrong size
Test 59 failed: expected 'submit' but got '' - <button> doesn't have type=submit
Test 64 failed: expected './test.html' but got 'test.html' - object elements didn't resolve URIs correctly
Test 69 failed: timeout -- could be a networking issue
Test 71 failed: expected '2' but got '1' - wrong number of children in #document (first test)
Test 72 failed: expected '20' but got '10' - change failed to take effect
Test 74 failed: contentDocument failed for <iframe> referencing an svg document.
Test 75 failed: contentDocument failed on <iframe> for svg document.
Test 76 failed: contentDocument failed on <object> for svg document.
Test 77 failed: contentDocument failed on <object> for svg document.
Test 78 failed: contentDocument failed on <object> for svg document.
Test 79 failed: Null value
Test 80 failed: Script in XHTML didn't execute
Test 84 failed: expected '0.0000e+0' but got 'NaN' - toExponential(4) wrong for 0
Test 86 failed: calling setMilliseconds() with no arguments didn't result in NaN
Test 88 failed: \u002b was not considered a parse error in script
Test 89 failed: orphaned bracket not considered parse error in regular expression literal
Test 90 failed: /(\3)(\1)(a)/ failed to match 'cat'
Test 98 failed: expected '[object Document]' but got 'null' - doctype's ownerDocument didn't change when it was assigned to another document
Total elapsed time: 9.86s

Iceweasel

Package:

iceweasel 3.0.9-1

Result rendering:

iceweasel.png

Log:

Failed 28 tests.
Test 01 failed: Component returned failure code: 0x80004001 (NS_ERROR_NOT_IMPLEMENTED) [nsIDOMDocumentTraversal.createNodeIterator]
Test 02 failed: Component returned failure code: 0x80004001 (NS_ERROR_NOT_IMPLEMENTED) [nsIDOMDocumentTraversal.createNodeIterator]
Test 03 failed: Component returned failure code: 0x80004001 (NS_ERROR_NOT_IMPLEMENTED) [nsIDOMDocumentTraversal.createNodeIterator]
Test 04 failed: Component returned failure code: 0x80004001 (NS_ERROR_NOT_IMPLEMENTED) [nsIDOMDocumentTraversal.createNodeIterator]
Test 07 failed: Component returned failure code: 0x80004005 (NS_ERROR_FAILURE) [nsIDOMRange.cloneContents]
Test 09 failed: expected 'Hello Wonderful KittyHow are you?' but got '' - toString() on range selecting Document gave wrong output
Test 10 failed: expected 'result' but got '' - toString() didn't work for attribute node
Test 11 failed: when inserting <a> into Document with another child: wrong exception raised
Test 26 passed, but took 315ms (less than 30fps)
Test 30 failed: Component returned failure code: 0x80070057 (NS_ERROR_ILLEGAL_VALUE) [nsIDOMEventTarget.dispatchEvent]
Test 33 failed: expected '1' but got '0' - whitespace error in class processing
Test 38 failed: p.childNodes[1].replaceWholeText is not a function
Test 39 failed: expected '1' but got '0' - :nth-child(odd) failed with child 0
Test 40 failed: expected '1' but got '0' - part 1:0
Test 46 failed: expected 'uppercase' but got 'none' - case a failed (index 1)
Test 54 failed: expected 'HIDDEN' but got 'hidden' - input control's type content attribute was wrong
Test 60 failed: attribute not specified after removal
Test 61 failed: expected ' te  st ' but got 'te st' - class attribute's value was wrong
Test 69 passed, but took 50 attempts (less than perfect).
Test 70 failed: UTF-8 encoded XML document with invalid character did not have a well-formedness error
Test 71 failed: expected 'null' but got '' - internalSubset wrong (first test)
Test 74 failed: getSVGDocument missing on <iframe> element.
Test 75 failed: anim.beginElement is not a function
Test 76 failed: expected '0' but got '100' - Incorrect animVal value after svg animation.
Test 77 failed: expected '4776' but got '7200' - getComputedTextLength failed.
Test 78 failed: expected '90' but got '0' - getRotationOfChar(0) failed.
Test 79 failed: expected '34' but got '33' - SVGSVGTextElement.getNumberOfChars() incorrect
Test 82 failed: unexpected 1 in t3
Test 95 failed: expected 'string' but got 'number' - type of |"2147483648"| is not string
Test 98 failed: expected 'Sparrow' but got '' - document.title did not update dynamically
Total elapsed time: 2.44s

Opera

Package: From repository: deb http://deb.opera.com/opera/ lenny non-free

opera

Result rendering:

opera.png

Log:

Failed 0 tests. 
Test 26 passed, but took 376ms (less than 30fps) 
Test 69 passed, but took 49 attempts (less than perfect). 
Test 71 passed, but took 46ms (less than 30fps) 
Total elapsed time: 3.95s

Summary

Ordering by best result, no bug on rendering and best time

Date 2009-06-21
Logiciel                       Result  Rendering  Time    Additionnal Notes
Opera                        100/100   nice       3.95s
Arora                        100/100   little bug 2.98s    LINKTEST FAILED
Chrome                       100/100   little bug 4.61s    Bug on rendering
Epiphany-browser              72/100   bug        ?        log incomplete
Kazehakase                    72/100   bug        0.87s
Iceweasel                     72/100   bug        2.44s
Konqueror                     52/100   horrible ! 9.86s